BDBM479425 US10894807, ID P218
SMILES OC(=O)CC[C@H](NC(=O)NC(CCCCNc1nc(cs1)-c1ccc(cc1)-n1cc(CCCF)nn1)C(O)=O)C(O)=O
InChI Key InChIKey=XKGIZSZJLXTZIO-ANYOKISRSA-N
Data  1 KI
  Tab Delimited (TSV)   2D SDfile   Computed 3D by Vconf -m prep SDfile
Find this compound or compounds like it in BindingDB:
Activity Spreadsheet -- Enzyme Inhibition Constant Data from BindingDB
Found 1 hit for monomerid = 479425
TargetGlutamate carboxypeptidase 2(Homo sapiens (Human))
Siemens Medical Solutions Usa
US Patent
LigandPNGBDBM479425(US10894807, ID P218)
Affinity DataKi:  0.600nM. Assay description: The inhibitory activity of all compounds was determined using a fluorescent assay of human PSMA activity. The enzyme used in the assay was purchased ...
Ligand InfoPC cidPC sid
In DepthDetails US Patent