BDBM479434 US10894807, ID P242
SMILES OC(=O)CC[C@H](NC(=O)N[C@@H](CCCCNc1cc(OCc2cn(CCF)nn2)ccc1[N+]([O-])=O)C(O)=O)C(O)=O
InChI Key InChIKey=ALIAOYCZQXIVLL-IRXDYDNUSA-N
Data  1 KI
  Tab Delimited (TSV)   2D SDfile   Computed 3D by Vconf -m prep SDfile
Find this compound or compounds like it in BindingDB:
Activity Spreadsheet -- Enzyme Inhibition Constant Data from BindingDB
Found 1 hit for monomerid = 479434
TargetGlutamate carboxypeptidase 2(Homo sapiens (Human))
Siemens Medical Solutions Usa
US Patent
LigandPNGBDBM479434(US10894807, ID P242)
Affinity DataKi:  0.0700nM. Assay description: The inhibitory activity of all compounds was determined using a fluorescent assay of human PSMA activity. The enzyme used in the assay was purchased ...
Ligand InfoPC cidPC sid
In DepthDetails US Patent