BDBM479442 US10894807, ID P251
SMILES OC(=O)CC[C@H](NC(=O)N[C@@H](CCCCNc1cc(OCCOCCOCCn2cc(CCCF)nn2)ccc1[N+]([O-])=O)C(O)=O)C(O)=O
InChI Key InChIKey=PNVNQELUAHCASL-GOTSBHOMSA-N
Data  1 KI
  Tab Delimited (TSV)   2D SDfile   Computed 3D by Vconf -m prep SDfile
Find this compound or compounds like it in BindingDB:
Activity Spreadsheet -- Enzyme Inhibition Constant Data from BindingDB
Found 1 hit for monomerid = 479442
TargetGlutamate carboxypeptidase 2(Homo sapiens (Human))
Siemens Medical Solutions Usa
US Patent
LigandPNGBDBM479442(US10894807, ID P251)
Affinity DataKi:  0.340nM. Assay description: The inhibitory activity of all compounds was determined using a fluorescent assay of human PSMA activity. The enzyme used in the assay was purchased ...
Ligand InfoPC cidPC sid
In DepthDetails US Patent