BDBM479452 US10894807, ID P272
SMILES OC(=O)CCC(NC(=O)N[C@H](CC1CCN(CC1)C(=O)c1cc(cc(c1)-n1cc(CCCF)nn1)C(=O)N1CCC(C[C@H](NC(=O)NC(CCC(O)=O)C(O)=O)C(O)=O)CC1)C(O)=O)C(O)=O
InChI Key InChIKey=RBNPWUKVLDDSBA-UDPYREPESA-N
Data  1 KI
  Tab Delimited (TSV)   2D SDfile   Computed 3D by Vconf -m prep SDfile
Find this compound or compounds like it in BindingDB:
Activity Spreadsheet -- Enzyme Inhibition Constant Data from BindingDB
Found 1 hit for monomerid = 479452
TargetGlutamate carboxypeptidase 2(Homo sapiens (Human))
Siemens Medical Solutions Usa
US Patent
LigandPNGBDBM479452(US10894807, ID P272)
Affinity DataKi:  2.5nM. Assay description: The inhibitory activity of all compounds was determined using a fluorescent assay of human PSMA activity. The enzyme used in the assay was purchased ...
Ligand InfoPC cidPC sid
In DepthDetails US Patent