BDBM479455 US10894807, ID P275
SMILES OC(=O)CCC(NC(=O)N[C@@H](Cc1ccc(NC(=O)N2CCN(CC2)C(=O)c2cc(cc(c2)-n2cc(CCCF)nn2)C(=O)N2CCN(CC2)C(=O)Nc2ccc(C[C@H](NC(=O)NC(CCC(O)=O)C(O)=O)C(O)=O)cc2)cc1)C(O)=O)C(O)=O
InChI Key InChIKey=URHVWUNJEKMWRW-GSEJFYCKSA-N
Data  1 KI
  Tab Delimited (TSV)   2D SDfile   Computed 3D by Vconf -m prep SDfile
Find this compound or compounds like it in BindingDB:
Activity Spreadsheet -- Enzyme Inhibition Constant Data from BindingDB
Found 1 hit for monomerid = 479455
TargetGlutamate carboxypeptidase 2(Homo sapiens (Human))
Siemens Medical Solutions Usa
US Patent
LigandPNGBDBM479455(US10894807, ID P275)
Affinity DataKi:  6.60nM. Assay description: The inhibitory activity of all compounds was determined using a fluorescent assay of human PSMA activity. The enzyme used in the assay was purchased ...
Ligand InfoPC cidPC sid
In DepthDetails US Patent