BDBM47948 2-(4-Fluoro-benzoylamino)-4-methyl-thiazole-5-carboxylic acid indan-5-ylamide::2-[(4-fluorobenzoyl)amino]-N-indan-5-yl-4-methyl-thiazole-5-carboxamide::MLS000556072::N-(2,3-dihydro-1H-inden-5-yl)-2-[(4-fluorobenzoyl)amino]-4-methyl-1,3-thiazole-5-carboxamide::N-(2,3-dihydro-1H-inden-5-yl)-2-[(4-fluorophenyl)carbonylamino]-4-methyl-1,3-thiazole-5-carboxamide::N-(2,3-dihydro-1H-inden-5-yl)-2-[[(4-fluorophenyl)-oxomethyl]amino]-4-methyl-5-thiazolecarboxamide::SMR000173001::cid_1468289
SMILES Cc1nc(NC(=O)c2ccc(F)cc2)sc1C(=O)Nc1ccc2CCCc2c1
InChI Key InChIKey=AOVUGFYXLDXERK-UHFFFAOYSA-N
Data  1 IC50
  Tab Delimited (TSV)   2D SDfile   Computed 3D by Vconf -m prep SDfile
Find this compound or compounds like it in BindingDB:
Activity Spreadsheet -- Enzyme Inhibition Constant Data from BindingDB
Found 1 hit for monomerid = 47948
TargetHeat shock protein HSP 90-alpha(Homo sapiens (Human))
The Scripps Research Institute Molecular Screening Center
Curated by PubChem BioAssay
LigandPNGBDBM47948(2-(4-Fluoro-benzoylamino)-4-methyl-thiazole-5-carb...)
Affinity DataIC50:  3.84E+3nM. Assay description: Source (MLPCN Center Name): The Scripps Research Institute Molecular Screening Center (SRIMSC) Center Affiliation: The Scripps Research Institute (TS...
In DepthDetails PCBioAssay