BDBM479565 US10899735, No. 24
SMILES COc1cc(nc(Cl)c1CN1CC2(C1)CNC(=O)C2)-c1cccc(c1Cl)-c1cccc(c1Cl)-c1ccc(CN2CC3(C2)CNC(=O)C3)c(OC)n1
InChI Key InChIKey=MMOIGGPDIFTJMI-UHFFFAOYSA-N
Data  1 IC50
  Tab Delimited (TSV)   2D SDfile   Computed 3D by Vconf -m prep SDfile
Find this compound or compounds like it in BindingDB:
Activity Spreadsheet -- Enzyme Inhibition Constant Data from BindingDB
Found 1 hit for monomerid = 479565
TargetProgrammed cell death 1 ligand 1/2(Homo sapiens (Human))
Gilead Sciences
US Patent
LigandPNGBDBM479565(US10899735, No. 24)
Affinity DataIC50:  118nM. Assay description: Compounds were tested in biochemical protein-protein interaction assays to determine if they can specifically block the interaction between the extra...
Ligand InfoPC cidPC sid
In DepthDetails US Patent