BDBM47959 1-{[2-(4-ethoxyphenyl)-5-methyl-1,3-oxazol-4-yl]methyl}-2-[2-(1H-pyrazol-1-yl)ethyl]piperidine::2-(4-ethoxyphenyl)-5-methyl-4-[[2-(2-pyrazol-1-ylethyl)piperidin-1-yl]methyl]-1,3-oxazole::2-(4-ethoxyphenyl)-5-methyl-4-[[2-[2-(1-pyrazolyl)ethyl]-1-piperidinyl]methyl]oxazole::5-methyl-2-p-phenetyl-4-[[2-(2-pyrazol-1-ylethyl)piperidino]methyl]oxazole::MLS000733527::SMR000318738::cid_16190663
SMILES CCOc1ccc(cc1)-c1nc(CN2CCCCC2CCn2cccn2)c(C)o1
InChI Key InChIKey=DTEYRIFHHIHDHU-UHFFFAOYSA-N
Data  1 IC50
  Tab Delimited (TSV)   2D SDfile   Computed 3D by Vconf -m prep SDfile
Find this compound or compounds like it in BindingDB:
Activity Spreadsheet -- Enzyme Inhibition Constant Data from BindingDB
Found 1 hit for monomerid = 47959
TargetHeat shock protein HSP 90-alpha(Homo sapiens (Human))
The Scripps Research Institute Molecular Screening Center
Curated by PubChem BioAssay
LigandPNGBDBM47959(1-{[2-(4-ethoxyphenyl)-5-methyl-1,3-oxazol-4-yl]me...)
Affinity DataIC50:  9.63E+3nM. Assay description: Source (MLPCN Center Name): The Scripps Research Institute Molecular Screening Center (SRIMSC) Center Affiliation: The Scripps Research Institute (TS...
Ligand InfoPC cidPC sid
In DepthDetails PCBioAssay