BDBM47962 3-chloranyl-N-(4-methyl-5-piperidin-1-ylcarbonyl-1,3-thiazol-2-yl)benzamide::3-chloro-N-[4-methyl-5-(piperidine-1-carbonyl)-1,3-thiazol-2-yl]benzamide::3-chloro-N-[4-methyl-5-(piperidine-1-carbonyl)thiazol-2-yl]benzamide::3-chloro-N-[4-methyl-5-[oxo(1-piperidinyl)methyl]-2-thiazolyl]benzamide::MLS000718514::SMR000290782::cid_1468320
SMILES Cc1nc(NC(=O)c2cccc(Cl)c2)sc1C(=O)N1CCCCC1
InChI Key InChIKey=OBXVSBYUBCOKIZ-UHFFFAOYSA-N
Data  1 IC50
  Tab Delimited (TSV)   2D SDfile   Computed 3D by Vconf -m prep SDfile
Find this compound or compounds like it in BindingDB:
Activity Spreadsheet -- Enzyme Inhibition Constant Data from BindingDB
Found 1 hit for monomerid = 47962
TargetHeat shock protein HSP 90-alpha(Homo sapiens (Human))
The Scripps Research Institute Molecular Screening Center
Curated by PubChem BioAssay
LigandPNGBDBM47962(3-chloranyl-N-(4-methyl-5-piperidin-1-ylcarbonyl-1...)
Affinity DataIC50:  6.40E+3nM. Assay description: Source (MLPCN Center Name): The Scripps Research Institute Molecular Screening Center (SRIMSC) Center Affiliation: The Scripps Research Institute (TS...
Ligand InfoPC cidPC sid
In DepthDetails PCBioAssay