BDBM47985 (3Z)-3-[2-keto-2-(2-thienyl)ethylidene]-6-methyl-4H-1,4-benzoxazin-2-one::(3Z)-6-methyl-3-(2-oxidanylidene-2-thiophen-2-yl-ethylidene)-4H-1,4-benzoxazin-2-one::(3Z)-6-methyl-3-(2-oxo-2-thiophen-2-ylethylidene)-4H-1,4-benzoxazin-2-one::6-Methyl-3-[2-oxo-2-thiophen-2-yl-eth-(E)-ylidene]-3,4-dihydro-benzo[1,4]oxazin-2-one::MLS000769639::SMR000434359::cid_6888847
SMILES Cc1ccc2oc(=O)c(CC(=O)c3cccs3)nc2c1
InChI Key InChIKey=BENVXSHLZXFTBI-UHFFFAOYSA-N
Data  1 IC50  3 EC50
  Tab Delimited (TSV)   2D SDfile   Computed 3D by Vconf -m prep SDfile
Find this compound or compounds like it in BindingDB:
Activity Spreadsheet -- Enzyme Inhibition Constant Data from BindingDB
Found 4 hits for monomerid = 47985
TargetHeat shock protein HSP 90-alpha(Homo sapiens (Human))
The Scripps Research Institute Molecular Screening Center
Curated by PubChem BioAssay
LigandPNGBDBM47985((3Z)-3-[2-keto-2-(2-thienyl)ethylidene]-6-methyl-4...)
Affinity DataIC50:  5.05E+3nM. Assay description: Source (MLPCN Center Name): The Scripps Research Institute Molecular Screening Center (SRIMSC) Center Affiliation: The Scripps Research Institute (TS...
In DepthDetails PCBioAssay
TargetCorticotropin-releasing factor-binding protein(Homo sapiens (Human))
Burnham Center For Chemical Genomics
Curated by PubChem BioAssay
LigandPNGBDBM47985((3Z)-3-[2-keto-2-(2-thienyl)ethylidene]-6-methyl-4...)
Affinity DataEC50:  4.87E+3nM. Assay description: Data Source: Sanford-Burnham Center for Chemical Genomics (SBCCG) Source Affiliation: Sanford-Burnham Medical Research Institute (SBMRI, San Diego, C...
In DepthDetails PCBioAssay
TargetPOsterior Segregation(Caenorhabditis elegans)
Broad Institute
Curated by PubChem BioAssay
LigandPNGBDBM47985((3Z)-3-[2-keto-2-(2-thienyl)ethylidene]-6-methyl-4...)
Affinity DataEC50:  2.13E+4nM. Assay description: Broad Institute: MLPCN maternal gene expression Project ID: 2024 Keywords: Zinc finger, C. elegans, maternal gene expression, RNA-protein interac...
In DepthDetails PCBioAssay
TargetZinc finger protein mex-5(Caenorhabditis elegans)
Broad Institute
Curated by PubChem BioAssay
LigandPNGBDBM47985((3Z)-3-[2-keto-2-(2-thienyl)ethylidene]-6-methyl-4...)
Affinity DataEC50:  6.82E+3nM. Assay description: Broad Institute: MLPCN maternal gene expression Project ID: 2024 Keywords: Zinc finger, C. elegans, maternal gene expression, RNA-protein interac...
In DepthDetails PCBioAssay