BDBM48020 (imidazol-2-ylideneamino)-(4-nitrophenyl)amine::2-[(E)-(4-nitrophenyl)diazenyl]-1H-imidazole::MLS001194491::N-(2-imidazolylideneamino)-4-nitroaniline::N-(imidazol-2-ylideneamino)-4-nitro-aniline::N-(imidazol-2-ylideneamino)-4-nitroaniline::SMR000555081::cid_12573566
SMILES [O-][N+](=O)c1ccc(cc1)\[NH+]=N\c1ncc[n-]1
InChI Key InChIKey=ACHOMBDHKICVPZ-OUKQBFOZSA-O
Data  3 IC50  3 EC50
  Tab Delimited (TSV)   2D SDfile   Computed 3D by Vconf -m prep SDfile
Find this compound or compounds like it in BindingDB:
Activity Spreadsheet -- Enzyme Inhibition Constant Data from BindingDB
Found 6 hits for monomerid = 48020
TargetHeat shock protein HSP 90-alpha(Homo sapiens (Human))
The Scripps Research Institute Molecular Screening Center
Curated by PubChem BioAssay
LigandPNGBDBM48020((imidazol-2-ylideneamino)-(4-nitrophenyl)amine | 2...)
Affinity DataIC50:  1.02E+4nM. Assay description: Source (MLPCN Center Name): The Scripps Research Institute Molecular Screening Center (SRIMSC) Center Affiliation: The Scripps Research Institute (TS...
In DepthDetails PCBioAssay
TargetPOsterior Segregation(Caenorhabditis elegans)
Broad Institute
Curated by PubChem BioAssay
LigandPNGBDBM48020((imidazol-2-ylideneamino)-(4-nitrophenyl)amine | 2...)
Affinity DataEC50:  6.91E+4nM. Assay description: Broad Institute: MLPCN maternal gene expression Project ID: 2024 Keywords: Zinc finger, C. elegans, maternal gene expression, RNA-protein interac...
In DepthDetails PCBioAssay
TargetType-1 angiotensin II receptor(Homo sapiens (Human))
Burnham Center For Chemical Genomics
Curated by PubChem BioAssay
LigandPNGBDBM48020((imidazol-2-ylideneamino)-(4-nitrophenyl)amine | 2...)
Affinity DataIC50:  2.35E+4nM. Assay description: Data Source: Sanford-Burnham Center for Chemical Genomics (SBCCG) Source Affiliation: Sanford-Burnham Medical Research Institute(SBMRI, San Diego, C...
In DepthDetails PCBioAssay
TargetHeat shock factor protein 1(Mus musculus)
Broad Institute
Curated by PubChem BioAssay
LigandPNGBDBM48020((imidazol-2-ylideneamino)-(4-nitrophenyl)amine | 2...)
Affinity DataEC50:  8.49E+3nM. Assay description: Keywords: Heat Shock Factor-1 (HSF-1), Stress Response, MG132, NIH3T3, Luminescence Assay Overview: Modified NIH3T3, transformed to express firefly...
In DepthDetails PCBioAssay
TargetApelin receptor(Homo sapiens (Human))
Sanford-Burnham Center For Chemical Genomics
Curated by PubChem BioAssay
LigandPNGBDBM48020((imidazol-2-ylideneamino)-(4-nitrophenyl)amine | 2...)
Affinity DataIC50:  1.36E+4nM. Assay description: Data Source: Sanford-Burnham Center for Chemical Genomics (SBCCG) Source Affiliation: Sanford- Sanford-Burnham Medical Research Institute(SBMRI, San...
In DepthDetails PCBioAssay
TargetZinc finger protein mex-5(Caenorhabditis elegans)
Broad Institute
Curated by PubChem BioAssay
LigandPNGBDBM48020((imidazol-2-ylideneamino)-(4-nitrophenyl)amine | 2...)
Affinity DataEC50:  2.07E+4nM. Assay description: Broad Institute: MLPCN maternal gene expression Project ID: 2024 Keywords: Zinc finger, C. elegans, maternal gene expression, RNA-protein interac...
In DepthDetails PCBioAssay