BDBM48025 5-[4-(diethylamino)phenyl]-N-(4-ethylphenyl)-4-phenyl-1,3,4-thiadiazol-4-ium-2-amine;chloride::MLS000948493::SMR000526909::cid_24789747::diethyl-[4-[5-(4-ethylanilino)-3-phenyl-1,3,4-thiadiazol-3-ium-2-yl]phenyl]amine;chloride
SMILES CCN(CC)c1ccc(cc1)-c1sc(Nc2ccc(CC)cc2)n[n+]1-c1ccccc1
InChI Key InChIKey=KFWJTKGBSDUECU-UHFFFAOYSA-N
Data  4 IC50  1 EC50
  Tab Delimited (TSV)   2D SDfile   Computed 3D by Vconf -m prep SDfile
Find this compound or compounds like it in BindingDB:
Activity Spreadsheet -- Enzyme Inhibition Constant Data from BindingDB
Found 5 hits for monomerid = 48025
TargetHeat shock protein HSP 90-alpha(Homo sapiens (Human))
The Scripps Research Institute Molecular Screening Center
Curated by PubChem BioAssay
LigandPNGBDBM48025(5-[4-(diethylamino)phenyl]-N-(4-ethylphenyl)-4-phe...)
Affinity DataIC50:  5.48E+3nM. Assay description: Source (MLPCN Center Name): The Scripps Research Institute Molecular Screening Center (SRIMSC) Center Affiliation: The Scripps Research Institute (TS...
In DepthDetails PCBioAssay
TargetEnvelope glycoprotein gp160(Human immunodeficiency virus type 1 group M subtyp...)
The Scripps Research Institute Molecular Screening Center
Curated by PubChem BioAssay
LigandPNGBDBM48025(5-[4-(diethylamino)phenyl]-N-(4-ethylphenyl)-4-phe...)
Affinity DataIC50: >6.70E+4nM
In DepthDetails PCBioAssay
TargetTumor necrosis factor receptor superfamily member 10B(Homo sapiens (Human))
Burnham Center For Chemical Genomics
Curated by PubChem BioAssay
LigandPNGBDBM48025(5-[4-(diethylamino)phenyl]-N-(4-ethylphenyl)-4-phe...)
Affinity DataEC50: >1.25E+4nM
In DepthDetails PCBioAssay
TargetEnvelope glycoprotein gp160(Human immunodeficiency virus type 1 group M subtyp...)
The Scripps Research Institute Molecular Screening Center
Curated by PubChem BioAssay
LigandPNGBDBM48025(5-[4-(diethylamino)phenyl]-N-(4-ethylphenyl)-4-phe...)
Affinity DataIC50: >6.70E+4nM
In DepthDetails PCBioAssay
TargetEnvelope glycoprotein gp160(Human immunodeficiency virus type 1 group M subtyp...)
The Scripps Research Institute Molecular Screening Center
Curated by PubChem BioAssay
LigandPNGBDBM48025(5-[4-(diethylamino)phenyl]-N-(4-ethylphenyl)-4-phe...)
Affinity DataIC50: >6.70E+4nM
In DepthDetails PCBioAssay