BDBM480394 (R)-5-(tert-butyl)-N-(1-(3-fluoro-2-methyl-4-(4-((1-methyl-1H-pyrazol-4-yl)amino)-1,3,5-triazin-2-yl)phenyl)ethyl)-1,2,4-oxadiazole-3-carboxamide ::US10899753, Example 73
SMILES C[C@@H](NC(=O)c1noc(n1)C(C)(C)C)c1ccc(c(F)c1C)-c1ncnc(Nc2cnn(C)c2)n1
InChI Key InChIKey=CLKSRZIOINZVAR-CYBMUJFWSA-N
Data  1 IC50
  Tab Delimited (TSV)   2D SDfile   Computed 3D by Vconf -m prep SDfile
Find this compound or compounds like it in BindingDB:
Activity Spreadsheet -- Enzyme Inhibition Constant Data from BindingDB
Found 1 hit for monomerid = 480394
TargetTyrosine-protein kinase BTK(Homo sapiens (Human))
Biogen Ma
US Patent
LigandPNGBDBM480394((R)-5-(tert-butyl)-N-(1-(3-fluoro-2-methyl-4-(4-((...)
Affinity DataIC50: <1nM. Assay description: The purpose of the BTK in vitro assay is to determine compound potency against BTK through the measurement of IC50. Compound inhibition is measured a...
Ligand InfoPC cidPC sid
In DepthDetails US Patent