BDBM48059 3-amino-4-methyl-6-(2-morpholinoethoxy)-N-p-anisyl-thieno[2,3-b]pyridine-2-carboxamide::3-amino-N-[(4-methoxyphenyl)methyl]-4-methyl-6-(2-morpholin-4-ylethoxy)thieno[2,3-b]pyridine-2-carboxamide::3-amino-N-[(4-methoxyphenyl)methyl]-4-methyl-6-[2-(4-morpholinyl)ethoxy]-2-thieno[2,3-b]pyridinecarboxamide::3-azanyl-N-[(4-methoxyphenyl)methyl]-4-methyl-6-(2-morpholin-4-ylethoxy)thieno[2,3-b]pyridine-2-carboxamide::VU0152119::cid_45142471
SMILES COc1ccc(CNC(=O)c2sc3nc(OCCN4CCOCC4)cc(C)c3c2N)cc1
InChI Key InChIKey=GRBWIUCZMJGFMR-UHFFFAOYSA-N
Data  1 EC50
  Tab Delimited (TSV)   2D SDfile   Computed 3D by Vconf -m prep SDfile
Find this compound or compounds like it in BindingDB:
Activity Spreadsheet -- Enzyme Inhibition Constant Data from BindingDB
Found 1 hit for monomerid = 48059
TargetMuscarinic acetylcholine receptor M4(RAT)
Vanderbilt Screening Center For Gpcrs, Ion Channels And Transporters
Curated by PubChem BioAssay
LigandPNGBDBM48059(3-amino-4-methyl-6-(2-morpholinoethoxy)-N-p-anisyl...)
Affinity DataEC50:  6.47E+3nM. Assay description: Assay Provider: Colleen Niswender Assay Provider Affiliation: Vanderbilt University Grant Title: Discovery of a Highly Selective in vitro and in vivo...
In DepthDetails PCBioAssay