BDBM480762 US10905687, Compound 20::US20230277527, Compound 20
SMILES OC(=O)C1CN(Cc2ccc(cc2)-c2ccc(cc2)C(O)(C(F)(F)F)C(F)(F)F)CCN1Cc1ccncc1
InChI Key InChIKey=DOWOTGQPANJPHH-UHFFFAOYSA-N
Data  2 IC50
  Tab Delimited (TSV)   2D SDfile   Computed 3D by Vconf -m prep SDfile
Find this compound or compounds like it in BindingDB:
Activity Spreadsheet -- Enzyme Inhibition Constant Data from BindingDB
Found 2 hits for monomerid = 480762
TargetNuclear receptor ROR-gamma(Homo sapiens (Human))
Escalier Biosciences
US Patent
LigandPNGBDBM480762(US10905687, Compound 20 | US20230277527, Compound ...)
Affinity DataIC50: >1.00E+4nM. Assay description: Human RORγ ligand binding assay was performed in 96-well format. The N-terminal DNA binding domains (DBD) of the native RORγ and RORγt...
Ligand InfoPC cidPC sid
In DepthDetails US Patent
TargetNuclear receptor ROR-gamma(Homo sapiens (Human))
Escalier Biosciences
US Patent
LigandPNGBDBM480762(US10905687, Compound 20 | US20230277527, Compound ...)
Affinity DataIC50: >1.00E+4nM. Assay description: Human RORγ ligand binding assay was performed in 96-well format. The N-terminal DNA binding domains (DBD) of the native RORγ and RORγt...
Ligand InfoPC cidPC sid
In DepthDetails US Patent