BDBM48088 1-[3-(3-nitrophenyl)-5-thiophen-2-yl-3,4-dihydropyrazol-2-yl]ethanone::1-[5-(3-nitrophenyl)-3-(2-thienyl)-2-pyrazolin-1-yl]ethanone::1-acetyl-5-(3-nitrophenyl)-3-(2-thienyl)-4,5-dihydro-1H-pyrazole::MLS000664921::SMR000294891::cid_2960534
SMILES CC(=O)N1N=C(CC1c1cccc(c1)[N+]([O-])=O)c1cccs1
InChI Key InChIKey=MFUHDDMCSUSJSX-UHFFFAOYSA-N
Data  1 IC50  1 EC50
  Tab Delimited (TSV)   2D SDfile   Computed 3D by Vconf -m prep SDfile
Find this compound or compounds like it in BindingDB:
Activity Spreadsheet -- Enzyme Inhibition Constant Data from BindingDB
Found 2 hits for monomerid = 48088
TargetKappa-type opioid receptor(Homo sapiens (Human))
Burnham Center For Chemical Genomics
Curated by PubChem BioAssay
LigandPNGBDBM48088(1-[3-(3-nitrophenyl)-5-thiophen-2-yl-3,4-dihydropy...)
Affinity DataIC50:  1.44E+4nM. Assay description: Data Source: Sanford-Burnham Center for Chemical Genomics (SBCCG) Source Affiliation: Sanford-Burnham Medical Research Institute (SBMRI, San Diego, C...
In DepthDetails PCBioAssay
TargetBeta-galactosidase(Escherichia coli)
Burnham Center For Chemical Genomics
Curated by PubChem BioAssay
LigandPNGBDBM48088(1-[3-(3-nitrophenyl)-5-thiophen-2-yl-3,4-dihydropy...)
Affinity DataEC50:  2.04E+4nM. Assay description: Data Source: Sanford-Burnham Center for Chemical Genomics (SBCCG) Source Affiliation: Sanford-Burnham Medical Research Institute (SBMRI, San Diego, C...
In DepthDetails PCBioAssay