BDBM480957 US10906888, Example 174
SMILES O=C(N1CC2(C1)CCOCC2)c1cnc(NC2(CCC2)c2cncnc2)nc1
InChI Key InChIKey=SOIRJOACMOTADL-UHFFFAOYSA-N
Data  1 IC50
  Tab Delimited (TSV)   2D SDfile   Computed 3D by Vconf -m prep SDfile
Find this compound or compounds like it in BindingDB:
Activity Spreadsheet -- Enzyme Inhibition Constant Data from BindingDB
Found 1 hit for monomerid = 480957
TargetPantetheinase(Homo sapiens (Human))
Pfizer
US Patent
LigandPNGBDBM480957(US10906888, Example 174)
Affinity DataIC50:  0.293nM. Assay description: The test inhibitors were solubilized in DMSO to a stock concentration of 30 mM. On the day of the assay, dose response plates were prepared by diluti...
Ligand InfoPC cidPC sid
In DepthDetails US Patent