BDBM481017 US10906890, Example 26.0
SMILES COc1ncnc(OC)c1-n1c(NS(=O)(=O)[C@@H](C)[C@H](C)c2cnc(C)cn2)nnc1-c1ccccc1
InChI Key InChIKey=MTMLENLBNLANKB-HOTGVXAUSA-N
Data  1 EC50
  Tab Delimited (TSV)   2D SDfile   Computed 3D by Vconf -m prep SDfile
Find this compound or compounds like it in BindingDB:
Activity Spreadsheet -- Enzyme Inhibition Constant Data from BindingDB
Found 1 hit for monomerid = 481017
TargetApelin receptor(Homo sapiens (Human))
Amgen
US Patent
LigandPNGBDBM481017(US10906890, Example 26.0)
Affinity DataEC50:  5.20nM. Assay description: The human APJ receptor was cloned by polymerase chain reaction and the gene encoding the receptor was subcloned in pFLAG-CMV™-3 expression vector (Si...
Ligand InfoPC cidPC sid
In DepthDetails US Patent