BDBM481031 US10906890, Example 42.0
SMILES CC(C)O[C@H]([C@H](C)S(=O)(=O)Nc1nnc(-c2ccccc2)n1-c1c(F)cccc1F)c1ncc(C)cn1
InChI Key InChIKey=KOCRWBVCLMVZHU-HTAPYJJXSA-N
Data  1 EC50
  Tab Delimited (TSV)   2D SDfile   Computed 3D by Vconf -m prep SDfile
Find this compound or compounds like it in BindingDB:
Activity Spreadsheet -- Enzyme Inhibition Constant Data from BindingDB
Found 1 hit for monomerid = 481031
TargetApelin receptor(Homo sapiens (Human))
Amgen
US Patent
LigandPNGBDBM481031(US10906890, Example 42.0)
Affinity DataEC50:  3.40nM. Assay description: The human APJ receptor was cloned by polymerase chain reaction and the gene encoding the receptor was subcloned in pFLAG-CMV™-3 expression vector (Si...
Ligand InfoPC cidPC sid
In DepthDetails US Patent