BDBM481052 US10906890, Example 64.0
SMILES COc1ncnc(OC)c1-n1c(NS(=O)(=O)[C@H]2C[C@H](CN(C2)c2ncc(F)cn2)OC(C)C)nnc1-c1ccccc1
InChI Key InChIKey=KHQQAWBIHJAWSY-UXHICEINSA-N
Data  1 EC50
  Tab Delimited (TSV)   2D SDfile   Computed 3D by Vconf -m prep SDfile
Find this compound or compounds like it in BindingDB:
Activity Spreadsheet -- Enzyme Inhibition Constant Data from BindingDB
Found 1 hit for monomerid = 481052
TargetApelin receptor(Homo sapiens (Human))
Amgen
US Patent
LigandPNGBDBM481052(US10906890, Example 64.0)
Affinity DataEC50:  4.70nM. Assay description: The human APJ receptor was cloned by polymerase chain reaction and the gene encoding the receptor was subcloned in pFLAG-CMV™-3 expression vector (Si...
Ligand InfoPC cidPC sid
In DepthDetails US Patent