BDBM481070 US10906890, Example 82.0
SMILES CO[C@@H]([C@H](C)S(=O)(=O)Nc1nnc(-c2ccc(Oc3ccccc3)cc2)n1-c1c(OC)cccc1OC)c1ncc(C)cn1
InChI Key InChIKey=DWIOKZJLAFMRKD-KMRXNPHXSA-N
Data  1 EC50
  Tab Delimited (TSV)   2D SDfile   Computed 3D by Vconf -m prep SDfile
Find this compound or compounds like it in BindingDB:
Activity Spreadsheet -- Enzyme Inhibition Constant Data from BindingDB
Found 1 hit for monomerid = 481070
TargetApelin receptor(Homo sapiens (Human))
Amgen
US Patent
LigandPNGBDBM481070(US10906890, Example 82.0)
Affinity DataEC50: >4.20E+3nM. Assay description: The human APJ receptor was cloned by polymerase chain reaction and the gene encoding the receptor was subcloned in pFLAG-CMV™-3 expression vector (Si...
Ligand InfoPC cidPC sid
In DepthDetails US Patent