BDBM481116 US10906896, Cpd 201
SMILES CN1CCN(Cc2ccc(cc2)C(=O)Nc2ccc(C)c(Nc3nccc(n3)-c3cncc(c3)C3=NN=C(C3)C(=O)Nc3ncco3)c2)CC1
InChI Key InChIKey=UHEXEECCTNTZTE-UHFFFAOYSA-N
Data  1 KI  2 IC50
  Tab Delimited (TSV)   2D SDfile   Computed 3D by Vconf -m prep SDfile
Find this compound or compounds like it in BindingDB:
Activity Spreadsheet -- Enzyme Inhibition Constant Data from BindingDB
Found 3 hits for monomerid = 481116
TargetMast/stem cell growth factor receptor Kit(Homo sapiens (Human))
Inhibikase Therapeutics
US Patent
LigandPNGBDBM481116(US10906896, Cpd 201)
Affinity DataKi:  19.3nM. Assay description: Kinase base buffer (50 mM HEPES, pH 7.5 0.0015% Brij-35; 10 mM MgCl2 2 mM DTT) and Stop buffer, (100 mM HEPES, pH 7.5 0.015% Brij-35; 0.2% Coating Re...
Ligand InfoPC cidPC sid
In DepthDetails US Patent
TargetTyrosine-protein kinase ABL1(Homo sapiens (Human))
Inhibikase Therapeutics
US Patent
LigandPNGBDBM481116(US10906896, Cpd 201)
Affinity DataIC50:  193nM. Assay description: Kinase base buffer (50 mM HEPES, pH 7.5 0.0015% Brij-35; 10 mM MgCl2 2 mM DTT) and Stop buffer, (100 mM HEPES, pH 7.5 0.015% Brij-35; 0.2% Coating Re...
Ligand InfoPC cidPC sid
In DepthDetails US Patent
TargetTyrosine-protein kinase ABL2(Homo sapiens (Human))
Inhibikase Therapeutics
US Patent
LigandPNGBDBM481116(US10906896, Cpd 201)
Affinity DataIC50:  514nM. Assay description: Kinase base buffer (50 mM HEPES, pH 7.5 0.0015% Brij-35; 10 mM MgCl2 2 mM DTT) and Stop buffer, (100 mM HEPES, pH 7.5 0.015% Brij-35; 0.2% Coating Re...
Ligand InfoPC cidPC sid
In DepthDetails US Patent