BDBM48134 6-bromanyl-2-[(1-methylimidazol-2-yl)sulfanylmethyl]imidazo[1,2-a]pyridine::6-bromo-2-[(1-methylimidazol-2-yl)sulfanylmethyl]imidazo[1,2-a]pyridine::6-bromo-2-[[(1-methyl-2-imidazolyl)thio]methyl]imidazo[1,2-a]pyridine::6-bromo-2-[[(1-methylimidazol-2-yl)thio]methyl]imidazo[1,2-a]pyridine::MLS000098102::SMR000061182::cid_3000090
SMILES Cn1ccnc1SCc1cn2cc(Br)ccc2n1
InChI Key InChIKey=AXCWVBQRHXIMPN-UHFFFAOYSA-N
Data  1 EC50
  Tab Delimited (TSV)   2D SDfile   Computed 3D by Vconf -m prep SDfile
Find this compound or compounds like it in BindingDB:
Activity Spreadsheet -- Enzyme Inhibition Constant Data from BindingDB
Found 1 hit for monomerid = 48134
TargetMatrix metalloproteinase-14 [1-36](Homo sapiens (Human))
Sanford-Burnham Center For Chemical Genomics
Curated by PubChem BioAssay
LigandPNGBDBM48134(6-bromanyl-2-[(1-methylimidazol-2-yl)sulfanylmethy...)
Affinity DataEC50:  1.50E+4nM. Assay description: Data Source: Sanford-Burnham Center for Chemical Genomics (SBCCG) Source Affiliation: Sanford-Burnham Medical Research Institute (SBMRI, San Diego, C...
In DepthDetails PCBioAssay