BDBM481710 N-(5-{[4-(2,3-dihydro-1,4- benzodioxin-6- ylmethylidene)piperidin-1- yl]methyl}-1,3-thiazol-2- yl)acetamide::US10913733, Example 20
SMILES [#6]-[#6](=O)-[#7]-c1ncc(-[#6]-[#7]-2-[#6]-[#6]\[#6](-[#6]-[#6]-2)=[#6]\c2ccc3-[#8]-[#6]-[#6]-[#8]-c3c2)s1
InChI Key InChIKey=XBMPZDZWJTUNIN-UHFFFAOYSA-N
Data  1 KI
  Tab Delimited (TSV)   2D SDfile   Computed 3D by Vconf -m prep SDfile
Find this compound or compounds like it in BindingDB:
Activity Spreadsheet -- Enzyme Inhibition Constant Data from BindingDB
Found 1 hit for monomerid = 481710
TargetProtein O-GlcNAcase(Homo sapiens (Human))
Alectos Therapeutics
US Patent
LigandPNGBDBM481710(N-(5-{[4-(2,3-dihydro-1,4- benzodioxin-6- ylmethyl...)
Affinity DataKi:  1.79nM. Assay description: Experimental procedure for kinetic analyses: Enzymatic reactions were carried out in a reaction containing 50 mM NaH2PO4, 100 mM NaCl and 0.1% BSA (p...
Ligand InfoPC cidPC sid
In DepthDetails US Patent