BDBM481732 N-(5-((4-(3- methoxybenzylidene)piperidin- 1-yl)methyl)thiazol-2- yl)acetamide::US10913733, Example 43
SMILES [#6]-[#8]-c1cccc(\[#6]=[#6]-2/[#6]-[#6]-[#7](-[#6]-c3cnc(-[#7]-[#6](-[#6])=O)s3)-[#6]-[#6]-2)c1
InChI Key InChIKey=SLCCUDUGIBRMTC-UHFFFAOYSA-N
Data  1 KI
  Tab Delimited (TSV)   2D SDfile   Computed 3D by Vconf -m prep SDfile
Find this compound or compounds like it in BindingDB:
Activity Spreadsheet -- Enzyme Inhibition Constant Data from BindingDB
Found 1 hit for monomerid = 481732
TargetProtein O-GlcNAcase(Homo sapiens (Human))
Alectos Therapeutics
US Patent
LigandPNGBDBM481732(N-(5-((4-(3- methoxybenzylidene)piperidin- 1-yl)me...)
Affinity DataKi:  2.93nM. Assay description: Experimental procedure for kinetic analyses: Enzymatic reactions were carried out in a reaction containing 50 mM NaH2PO4, 100 mM NaCl and 0.1% BSA (p...
Ligand InfoPC cidPC sid
In DepthDetails US Patent