BDBM481766 4-[2-[5-[(5-methyl-4-oxo- pyrido[2,3-d]pyrimidin-3- yl)methyl]-2-oxo-1,3,4- oxadiazol-3- yl]ethyl]benzonitrile::US10913742, Example 8
SMILES Cc1ccnc2ncn(Cc3nn(CCc4ccc(cc4)C#N)c(=O)o3)c(=O)c12
InChI Key InChIKey=FWEQDPBXQWFBRT-UHFFFAOYSA-N
Data  1 IC50
  Tab Delimited (TSV)   2D SDfile   Computed 3D by Vconf -m prep SDfile
Find this compound or compounds like it in BindingDB:
Activity Spreadsheet -- Enzyme Inhibition Constant Data from BindingDB
Found 1 hit for monomerid = 481766
TargetTransient receptor potential cation channel subfamily A member 1(Homo sapiens (Human))
Genentech
US Patent
LigandPNGBDBM481766(4-[2-[5-[(5-methyl-4-oxo- pyrido[2,3-d]pyrimidin-3...)
Affinity DataIC50:  166nM. Assay description: The IC50 (effective concentration) of compounds on the human and rat TRPA1 channels were determined using a FLIPR Tetra instrument. CHO cells express...
Ligand InfoPC cidPC sid
In DepthDetails US Patent