BDBM481769 3-(4-methoxyphenethyl)-5- ((7-methyl-6-oxo-6H-purin- 1(7H)-yl)methyl)-1,3,4- oxadiazol-2(3H)-one::US10913742, Example 11
SMILES COc1ccc(CCn2nc(Cn3cnc4ncn(C)c4c3=O)oc2=O)cc1
InChI Key InChIKey=XQVDMHKTSFSEMQ-UHFFFAOYSA-N
Data  1 IC50
  Tab Delimited (TSV)   2D SDfile   Computed 3D by Vconf -m prep SDfile
Find this compound or compounds like it in BindingDB:
Activity Spreadsheet -- Enzyme Inhibition Constant Data from BindingDB
Found 1 hit for monomerid = 481769
TargetTransient receptor potential cation channel subfamily A member 1(Homo sapiens (Human))
Genentech
US Patent
LigandPNGBDBM481769(3-(4-methoxyphenethyl)-5- ((7-methyl-6-oxo-6H-puri...)
Affinity DataIC50:  278nM. Assay description: The IC50 (effective concentration) of compounds on the human and rat TRPA1 channels were determined using a FLIPR Tetra instrument. CHO cells express...
Ligand InfoPC cidPC sid
In DepthDetails US Patent