BDBM481795 5-[(7-methyl-6-oxo-purin-1- yl)methyl]-3-[(2S)-2-fluoro-2- (2-naphthyl)ethyl]-1,3,4- oxadiazol-2-one::US10913742, Example 37
SMILES Cn1cnc2ncn(Cc3nn(C[C@@H](F)c4ccc5ccccc5c4)c(=O)o3)c(=O)c12
InChI Key InChIKey=VSBSCGNEPYTOEU-MRXNPFEDSA-N
Data  1 IC50
  Tab Delimited (TSV)   2D SDfile   Computed 3D by Vconf -m prep SDfile
Find this compound or compounds like it in BindingDB:
Activity Spreadsheet -- Enzyme Inhibition Constant Data from BindingDB
Found 1 hit for monomerid = 481795
TargetTransient receptor potential cation channel subfamily A member 1(Homo sapiens (Human))
Genentech
US Patent
LigandPNGBDBM481795(5-[(7-methyl-6-oxo-purin-1- yl)methyl]-3-[(2S)-2-f...)
Affinity DataIC50:  332nM. Assay description: The IC50 (effective concentration) of compounds on the human and rat TRPA1 channels were determined using a FLIPR Tetra instrument. CHO cells express...
Ligand InfoPC cidPC sid
In DepthDetails US Patent