BDBM481799 3-(4-chloro-2-fluorophenethyl)- 5-((7-methyl-6-oxo-6H-purin- 1(7H)-yl)methyl)-1,3,4- oxadiazol-2(3H)-one::US10913742, Example 41
SMILES Cn1cnc2ncn(Cc3nn(CCc4ccc(Cl)cc4F)c(=O)o3)c(=O)c12
InChI Key InChIKey=CNXACZHZGCZDBO-UHFFFAOYSA-N
Data  1 IC50
  Tab Delimited (TSV)   2D SDfile   Computed 3D by Vconf -m prep SDfile
Find this compound or compounds like it in BindingDB:
Activity Spreadsheet -- Enzyme Inhibition Constant Data from BindingDB
Found 1 hit for monomerid = 481799
TargetTransient receptor potential cation channel subfamily A member 1(Homo sapiens (Human))
Genentech
US Patent
LigandPNGBDBM481799(3-(4-chloro-2-fluorophenethyl)- 5-((7-methyl-6-oxo...)
Affinity DataIC50:  492nM. Assay description: The IC50 (effective concentration) of compounds on the human and rat TRPA1 channels were determined using a FLIPR Tetra instrument. CHO cells express...
Ligand InfoPC cidPC sid
In DepthDetails US Patent