BDBM481817 US10913742, Example 60::trans-3-[3-(4- chlorophenyl)cyclobutyl]-5- [(2-deuterio-7-methyl-6- oxo-purin-1-yl)methyl]- 1,3,4-oxadiazol-2-one
SMILES Cn1cnc2ncn(Cc3nn([C@H]4C[C@@H](C4)c4ccc(Cl)cc4)c(=O)o3)c(=O)c12
InChI Key InChIKey=CYWFSLKYTRCPPA-MQMHXKEQSA-N
Data  1 IC50
  Tab Delimited (TSV)   2D SDfile   Computed 3D by Vconf -m prep SDfile
Find this compound or compounds like it in BindingDB:
Activity Spreadsheet -- Enzyme Inhibition Constant Data from BindingDB
Found 1 hit for monomerid = 481817
TargetTransient receptor potential cation channel subfamily A member 1(Homo sapiens (Human))
Genentech
US Patent
LigandPNGBDBM481817(US10913742, Example 60 | trans-3-[3-(4- chlorophen...)
Affinity DataIC50:  28.4nM. Assay description: The IC50 (effective concentration) of compounds on the human and rat TRPA1 channels were determined using a FLIPR Tetra instrument. CHO cells express...
Ligand InfoPC cidPC sid
In DepthDetails US Patent