BDBM481895 US10913745, Example 1.09
SMILES COC(=O)c1ccc(cc1)C(=O)N1C[C@@H]2CN(C[C@@H]2C1)C(=O)OCc1cc(Cl)cc(Cl)c1
InChI Key InChIKey=NUEYFOCINLFWLI-HDICACEKSA-N
Data  1 IC50
  Tab Delimited (TSV)   2D SDfile   Computed 3D by Vconf -m prep SDfile
Find this compound or compounds like it in BindingDB:
Activity Spreadsheet -- Enzyme Inhibition Constant Data from BindingDB
Found 1 hit for monomerid = 481895
TargetAtaxin-1(Homo sapiens (Human))
Hoffmann-La Roche
US Patent
LigandPNGBDBM481895(US10913745, Example 1.09)
Affinity DataIC50:  118nM. Assay description: Assay buffer (50 mM Tris-HCl, 140 mM NaCl, 5 mM KCl, 1 mM CaCl2, 1 mM MgCl2, 0.01% Triton-X-100, pH 8.0;ATX solution: ATX (human His-tagged) stock so...
Ligand InfoPC cidPC sid
In DepthDetails US Patent