BDBM481968 US10913753, Compound I-35
SMILES Cc1ccc2c(N)c(sc2n1)C(=O)NCCc1cc(F)c(N2CCNCC2)c(F)c1F
InChI Key InChIKey=XQHVIROUEDHSII-UHFFFAOYSA-N
Data  1 IC50
  Tab Delimited (TSV)   2D SDfile   Computed 3D by Vconf -m prep SDfile
Find this compound or compounds like it in BindingDB:
Activity Spreadsheet -- Enzyme Inhibition Constant Data from BindingDB
Found 1 hit for monomerid = 481968
TargetUbiquitin carboxyl-terminal hydrolase 28(Homo sapiens)
Valo Early Discovery
US Patent
LigandPNGBDBM481968(US10913753, Compound I-35)
Affinity DataIC50: <200nM. Assay description: USP28: The assay was performed in a final volume of 20 uL in assay buffer containing 20 mM Tris-HCl (pH 8.0, (1M Tris-HCl, pH 8.0 solution; Corning 4...
Ligand InfoPC cidPC sid
In DepthDetails US Patent