BDBM48197 2-[4-(4-hexoxybenzyl)piperazino]ethanol::2-[4-[(4-hexoxyphenyl)methyl]-1-piperazinyl]ethanol::2-[4-[(4-hexoxyphenyl)methyl]piperazin-1-yl]ethanol::MLS000106508::SMR000103475::cid_2845552
SMILES CCCCCCOc1ccc(CN2CCN(CCO)CC2)cc1
InChI Key InChIKey=ISIDNHHICJZYFM-UHFFFAOYSA-N
Data  1 EC50
  Tab Delimited (TSV)   2D SDfile   Computed 3D by Vconf -m prep SDfile
Find this compound or compounds like it in BindingDB:
Activity Spreadsheet -- Enzyme Inhibition Constant Data from BindingDB
Found 1 hit for monomerid = 48197
TargetMatrix metalloproteinase-14 [1-36](Homo sapiens (Human))
Sanford-Burnham Center For Chemical Genomics
Curated by PubChem BioAssay
LigandPNGBDBM48197(2-[4-(4-hexoxybenzyl)piperazino]ethanol | 2-[4-[(4...)
Affinity DataEC50:  1.21E+4nM. Assay description: Data Source: Sanford-Burnham Center for Chemical Genomics (SBCCG) Source Affiliation: Sanford-Burnham Medical Research Institute (SBMRI, San Diego, C...
In DepthDetails PCBioAssay