BDBM482105 US10913753, Compound I-172::US20230365583, Compound 23
SMILES Cc1ccc2c(N)c(sc2n1)C(=O)NCCc1ccc(cc1)C1CC2CCC(C1)N2
InChI Key InChIKey=CRTNETOPEFHLTG-UHFFFAOYSA-N
Data  3 IC50
  Tab Delimited (TSV)   2D SDfile   Computed 3D by Vconf -m prep SDfile
Find this compound or compounds like it in BindingDB:
Activity Spreadsheet -- Enzyme Inhibition Constant Data from BindingDB
Found 3 hits for monomerid = 482105
TargetUbiquitin carboxyl-terminal hydrolase 28(Homo sapiens)
Valo Early Discovery
US Patent
LigandPNGBDBM482105(US10913753, Compound I-172 | US20230365583, Compou...)
Affinity DataIC50: <200nM. Assay description: USP28: The assay was performed in a final volume of 20 uL in assay buffer containing 20 mM Tris-HCl (pH 8.0, (1M Tris-HCl, pH 8.0 solution; Corning 4...
Ligand InfoPC cidPC sid
In DepthDetails US Patent
TargetUbiquitin carboxyl-terminal hydrolase 28(Homo sapiens)
Valo Early Discovery
US Patent
LigandPNGBDBM482105(US10913753, Compound I-172 | US20230365583, Compou...)
Affinity DataIC50: <1.00E+3nM. Assay description: USP28 (at 1 nM) was pre-incubated with different concentrations of inhibitors or DMSO as a control in 50 mM Tris pH 8, 50 mM NaCl, 0.002% Tween-20, 5...
Ligand InfoPC cidPC sid
In DepthDetails US Patent
TargetUbiquitin carboxyl-terminal hydrolase 25(Homo sapiens)
Valo Early Discovery
US Patent
LigandPNGBDBM482105(US10913753, Compound I-172 | US20230365583, Compou...)
Affinity DataIC50: <200nM. Assay description: USP25: The assay was performed in a final volume of 9 uL in assay buffer containing 20 mM Tris-HCl (pH 8.0, (1M Tris-HC1, pH 8.0 solution; Corning 46...
Ligand InfoPC cidPC sid
In DepthDetails US Patent