BDBM482201 N-[3-(4-Amino-7-methyl-7H-pyrrolo[2,3-d]pyrimidin-5-yl)-2-fluoro-phenyl]-4-bromo-2,5-difluoro-benzenesulfonamide ::US10918642, Cmpd # 46::US11491158, Cmpd 46
SMILES Cn1cc(-c2cccc(NS(=O)(=O)c3cc(F)c(Br)cc3F)c2F)c2c(N)ncnc12
InChI Key InChIKey=FOQSCFGLUDRRJN-UHFFFAOYSA-N
Data  2 IC50
  Tab Delimited (TSV)   2D SDfile   Computed 3D by Vconf -m prep SDfile
Find this compound or compounds like it in BindingDB:
Activity Spreadsheet -- Enzyme Inhibition Constant Data from BindingDB
Found 2 hits for monomerid = 482201
TargetEukaryotic translation initiation factor 2-alpha kinase 3 [540-1115](Homo sapiens (Human))
Nerviano Medical Sciences
US Patent
LigandPNGBDBM482201(N-[3-(4-Amino-7-methyl-7H-pyrrolo[2,3-d]pyrimidin-...)
Affinity DataIC50: <16nM. Assay description: The biochemical activity of compounds was determined by incubation with PERK recombinant enzyme (cytoplasmic domain corresponding to residues 540-111...
Ligand InfoPC cidPC sid
In DepthDetails US Patent
TargetEukaryotic translation initiation factor 2-alpha kinase 3(Homo sapiens (Human))
Nerviano Medical Sciences
US Patent
LigandPNGBDBM482201(N-[3-(4-Amino-7-methyl-7H-pyrrolo[2,3-d]pyrimidin-...)
Affinity DataIC50: <16nM. Assay description: Compounds were 3-fold serially diluted in order to obtain from 3.333 to 0.000169 microM final concentration, then incubated for 60 minutes at room te...
Ligand InfoPC cidPC sid
In DepthDetails US Patent