BDBM48244 MLS000535585::N-(3-cyano-4,5,6,7-tetrahydro-1-benzothien-2-yl)-2-(4H-1,2,4-triazol-3-ylthio)acetamide::N-(3-cyano-4,5,6,7-tetrahydro-1-benzothiophen-2-yl)-2-(1H-1,2,4-triazol-5-ylsulfanyl)acetamide::N-(3-cyano-4,5,6,7-tetrahydro-1-benzothiophen-2-yl)-2-(1H-1,2,4-triazol-5-ylsulfanyl)ethanamide::N-(3-cyano-4,5,6,7-tetrahydro-1-benzothiophen-2-yl)-2-(1H-1,2,4-triazol-5-ylthio)acetamide::N-(3-cyano-4,5,6,7-tetrahydrobenzothiophen-2-yl)-2-(1H-1,2,4-triazol-5-ylthio)acetamide::SMR000143021::cid_838555
SMILES O=C(CSc1nnc[nH]1)Nc1sc2CCCCc2c1C#N
InChI Key InChIKey=DHDKKNRCKBHABW-UHFFFAOYSA-N
Data  1 IC50  1 EC50
  Tab Delimited (TSV)   2D SDfile   Computed 3D by Vconf -m prep SDfile
Find this compound or compounds like it in BindingDB:
Activity Spreadsheet -- Enzyme Inhibition Constant Data from BindingDB
Found 2 hits for monomerid = 48244
TargetM17 leucyl aminopeptidase(Plasmodium falciparum 3D7)
Srmlsc
Curated by PubChem BioAssay
LigandPNGBDBM48244(MLS000535585 | N-(3-cyano-4,5,6,7-tetrahydro-1-ben...)
Affinity DataIC50:  4.79E+3nM. Assay description: Southern Research Molecular Libraries Screening Center (SRMLSC) Southern Research Institute (Birmingham, Alabama) NIH Molecular Libraries Screening...
In DepthDetails PCBioAssay
TargetMatrix metalloproteinase-14 [1-36](Homo sapiens (Human))
Sanford-Burnham Center For Chemical Genomics
Curated by PubChem BioAssay
LigandPNGBDBM48244(MLS000535585 | N-(3-cyano-4,5,6,7-tetrahydro-1-ben...)
Affinity DataEC50:  730nM. Assay description: Data Source: Sanford-Burnham Center for Chemical Genomics (SBCCG) Source Affiliation: Sanford-Burnham Medical Research Institute (SBMRI, San Diego, C...
In DepthDetails PCBioAssay