BDBM482847 5-(3,3- difluoropiperidine- 1-carboxamido)-1- (2-((2S,4R)-4- fluoro-2-((S)-1- hydroxy-2-(6- methylpyridin-2- yl)ethyl)pyrrolidin- 1-yl)-2-oxoethyl)- 1H-indole-3- carboxamide::US10919884, Cmp No. 3::US11649229, Cmp No. 3
SMILES Cc1cccc(CC(O)[C@@H]2C[C@@H](F)CN2C(=O)Cn2cc(C(N)=O)c3cc(NC(=O)N4CCCC(F)(F)C4)ccc23)n1
InChI Key InChIKey=VSFZVHRDZJDASO-GBTGNHPCSA-N
Data  2 IC50
  Tab Delimited (TSV)   2D SDfile   Computed 3D by Vconf -m prep SDfile
Find this compound or compounds like it in BindingDB:
Activity Spreadsheet -- Enzyme Inhibition Constant Data from BindingDB
Found 2 hits for monomerid = 482847
TargetComplement factor D(Homo sapiens (Human))
Achillion Pharmaceuticals
US Patent
LigandPNGBDBM482847(5-(3,3- difluoropiperidine- 1-carboxamido)-1- (2-(...)
Affinity DataIC50:  5.50E+4nM. Assay description: Human Factor D (purified from human serum, Complement Technology, Inc.) at 80 nM final concentration is incubated with test compound at various conce...
Ligand InfoPC cidPC sid
In DepthDetails US Patent
TargetComplement factor D(Homo sapiens (Human))
Achillion Pharmaceuticals
US Patent
LigandPNGBDBM482847(5-(3,3- difluoropiperidine- 1-carboxamido)-1- (2-(...)
Affinity DataIC50: >1.00E+4nM. Assay description: Human Factor D (purified from human serum, Complement Technology, Inc.) at 80 nM final concentration is incubated with test compound at various conce...
Ligand InfoPC cidPC sid
In DepthDetails US Patent