BDBM48331 2-azanylidene-N-(1,3-benzodioxol-5-ylmethyl)-5-oxidanylidene-1-(pyridin-3-ylmethyl)dipyrido[1,2-d:3',4'-f]pyrimidine-3-carboxamide::2-imino-5-keto-N-piperonyl-1-(3-pyridylmethyl)dipyrido[1,2-d:3',4'-f]pyrimidine-3-carboxamide::MLS000040412::N-(1,3-benzodioxol-5-ylmethyl)-2-imino-5-oxo-1-(3-pyridinylmethyl)-3-dipyrido[1,2-d:3',4'-f]pyrimidinecarboxamide::N-(1,3-benzodioxol-5-ylmethyl)-2-imino-5-oxo-1-(pyridin-3-ylmethyl)dipyrido[1,2-d:3',4'-f]pyrimidine-3-carboxamide::SMR000043282::cid_662595
SMILES N=c1c(cc2c(nc3ccccn3c2=O)n1Cc1cccnc1)C(=O)NCc1ccc2OCOc2c1
InChI Key InChIKey=UQXVMCPFDVTXMC-UHFFFAOYSA-N
Data  6 IC50
  Tab Delimited (TSV)   2D SDfile   Computed 3D by Vconf -m prep SDfile
Find this compound or compounds like it in BindingDB:
Activity Spreadsheet -- Enzyme Inhibition Constant Data from BindingDB
Found 6 hits for monomerid = 48331
TargetInduced myeloid leukemia cell differentiation protein Mcl-1(Homo sapiens (Human))
Emory University
Curated by PubChem BioAssay
LigandPNGBDBM48331(2-azanylidene-N-(1,3-benzodioxol-5-ylmethyl)-5-oxi...)
Affinity DataIC50:  4.30E+3nM. Assay description: NIH Molecular Libraries Screening Centers Network [MLSCN] Emory Chemical Biology Discovery Center in MLSCN Assay provider: Nikolovska-Coleska, Univer...
In DepthDetails PCBioAssay
TargetEstrogen receptor beta(Homo sapiens (Human))
Emory University
Curated by PubChem BioAssay
LigandPNGBDBM48331(2-azanylidene-N-(1,3-benzodioxol-5-ylmethyl)-5-oxi...)
Affinity DataIC50:  5.00E+4nM. Assay description: NIH Molecular Libraries Screening Centers Network [MLSCN] Emory Chemical Biology Discovery Center in MLSCN Assay provider: John A. Katzenellenbogen, ...
In DepthDetails PCBioAssay
TargetTyrosine-protein phosphatase non-receptor type 22(Homo sapiens (Human))
Burnham Center For Chemical Genomics
Curated by PubChem BioAssay
LigandPNGBDBM48331(2-azanylidene-N-(1,3-benzodioxol-5-ylmethyl)-5-oxi...)
Affinity DataIC50: >8.00E+4nM
In DepthDetails PCBioAssay
TargetLow molecular weight phosphotyrosine protein phosphatase(Homo sapiens (Human))
Burnham Center For Chemical Genomics
Curated by PubChem BioAssay
LigandPNGBDBM48331(2-azanylidene-N-(1,3-benzodioxol-5-ylmethyl)-5-oxi...)
Affinity DataIC50:  1.71E+4nM
In DepthDetails PCBioAssay
TargetLow molecular weight phosphotyrosine protein phosphatase(Homo sapiens (Human))
Burnham Center For Chemical Genomics
Curated by PubChem BioAssay
LigandPNGBDBM48331(2-azanylidene-N-(1,3-benzodioxol-5-ylmethyl)-5-oxi...)
Affinity DataIC50: >8.00E+4nM
In DepthDetails PCBioAssay
TargetEstrogen receptor beta(Homo sapiens (Human))
Emory University
Curated by PubChem BioAssay
LigandPNGBDBM48331(2-azanylidene-N-(1,3-benzodioxol-5-ylmethyl)-5-oxi...)
Affinity DataIC50:  5.48E+3nM. Assay description: NIH Molecular Libraries Screening Centers Network [MLSCN] Emory Chemical Biology Discovery Center in MLSCN Assay provider: John A. Katzenellenbogen, ...
In DepthDetails PCBioAssay