BDBM483422 US10919911, Example 44
SMILES O=C(Nc1cccc2-c3nncn3CCOc12)c1cc(c(cn1)N1CCOCC1)-n1cnc(c1)C1CC1
InChI Key InChIKey=PKLDSHUITNOPLZ-UHFFFAOYSA-N
Data  1 IC50
  Tab Delimited (TSV)   2D SDfile   Computed 3D by Vconf -m prep SDfile
Find this compound or compounds like it in BindingDB:
Activity Spreadsheet -- Enzyme Inhibition Constant Data from BindingDB
Found 1 hit for monomerid = 483422
TargetMitogen-activated protein kinase kinase kinase 5(Homo sapiens (Human))
Terns
US Patent
LigandPNGBDBM483422(US10919911, Example 44)
Affinity DataIC50:  15.6nM. Assay description: Base Reaction buffer: 20 mM Hepes (pH 7.5), 10 mM MgCl2, 1 mM EGTA, 0.02% Brij35, 0.02 mg/ml BSA, 0.1 mM Na3VO4, 2 mM DTT, and 1% DMSO were used for ...
Ligand InfoPC cidPC sid
In DepthDetails US Patent