BDBM483441 US10919911, Example 63
SMILES CC1(O)CCN(C1)c1cnc(cc1-n1cnc(c1)C1CC1)C(=O)Nc1cccc2-c3nnnn3CCOc12
InChI Key InChIKey=XUEMHVURMGBLIN-UHFFFAOYSA-N
Data  1 IC50
  Tab Delimited (TSV)   2D SDfile   Computed 3D by Vconf -m prep SDfile
Find this compound or compounds like it in BindingDB:
Activity Spreadsheet -- Enzyme Inhibition Constant Data from BindingDB
Found 1 hit for monomerid = 483441
TargetMitogen-activated protein kinase kinase kinase 5(Homo sapiens (Human))
Terns
US Patent
LigandPNGBDBM483441(US10919911, Example 63)
Affinity DataIC50:  2.70nM. Assay description: Base Reaction buffer: 20 mM Hepes (pH 7.5), 10 mM MgCl2, 1 mM EGTA, 0.02% Brij35, 0.02 mg/ml BSA, 0.1 mM Na3VO4, 2 mM DTT, and 1% DMSO were used for ...
Ligand InfoPC cidPC sid
In DepthDetails US Patent