BDBM483454 US10919911, Example 76
SMILES C[C@@H]1CN(CCO1)c1cnc(cc1-n1cnc(c1)C1CC1)C(=O)Nc1cccc2-c3nnnn3[C@@H](C)COc12
InChI Key InChIKey=OMJFLTQADOEXJM-DLBZAZTESA-N
Data  1 IC50
  Tab Delimited (TSV)   2D SDfile   Computed 3D by Vconf -m prep SDfile
Find this compound or compounds like it in BindingDB:
Activity Spreadsheet -- Enzyme Inhibition Constant Data from BindingDB
Found 1 hit for monomerid = 483454
TargetMitogen-activated protein kinase kinase kinase 5(Homo sapiens (Human))
Terns
US Patent
LigandPNGBDBM483454(US10919911, Example 76)
Affinity DataIC50:  3.20nM. Assay description: Base Reaction buffer: 20 mM Hepes (pH 7.5), 10 mM MgCl2, 1 mM EGTA, 0.02% Brij35, 0.02 mg/ml BSA, 0.1 mM Na3VO4, 2 mM DTT, and 1% DMSO were used for ...
Ligand InfoPC cidPC sid
In DepthDetails US Patent