BDBM483465 US10925840, Compound (R,R)-2
SMILES COc1ccc(C[C@@H](C)CC[C@H](O)c2cc(O)cc(O)c2)cc1
InChI Key InChIKey=WZZMTFIAXVXMPQ-DJJJIMSYSA-N
Data  2 KI
  Tab Delimited (TSV)   2D SDfile   Computed 3D by Vconf -m prep SDfile
Find this compound or compounds like it in BindingDB:
Activity Spreadsheet -- Enzyme Inhibition Constant Data from BindingDB
Found 2 hits for monomerid = 483465
TargetBeta-2 adrenergic receptor(Homo sapiens (Human))
The Usa, As Represented By The Secretary, Department Of Health And Human Services
US Patent
LigandPNGBDBM483465(US10925840, Compound (R,R)-2)
Affinity DataKi:  4.74E+5nM. Assay description: Twenty-four hours after adenoviral infection with human β2-AR, HEK293 cells were harvested in lysis buffer, Tris-HCl [5 mM, pH 7.4] containing E...
Ligand InfoPC cidPC sid
In DepthDetails US Patent
TargetBeta-1 adrenergic receptor(Homo sapiens (Human))
The Usa, As Represented By The Secretary, Department Of Health And Human Services
US Patent
LigandPNGBDBM483465(US10925840, Compound (R,R)-2)
Affinity DataKi:  2.20E+7nM. Assay description: Twenty-four hours after adenoviral infection with human β2-AR, HEK293 cells were harvested in lysis buffer, Tris-HCl [5 mM, pH 7.4] containing E...
Ligand InfoPC cidPC sid
In DepthDetails US Patent