BDBM483489 US10927076, Compound Table1A.5
SMILES CC(C)Cc1cc(O)c(cc1C(C)C)C(=O)N1Cc2ccccc2C1
InChI Key InChIKey=LDBKXMVILHTIAL-UHFFFAOYSA-N
Data  2 Kd
  Tab Delimited (TSV)   2D SDfile   Computed 3D by Vconf -m prep SDfile
Find this compound or compounds like it in BindingDB:
Activity Spreadsheet -- Enzyme Inhibition Constant Data from BindingDB
Found 2 hits for monomerid = 483489
TargetHeat shock protein HSP 90-alpha(Homo sapiens (Human))
University Of Kansas
US Patent
LigandPNGBDBM483489(US10927076, Compound Table1A.5)
Affinity DataKd: >1.00E+5nM. Assay description: Assay was performed in 96-well format in black, flat bottom plates (Santa Cruz Biotechnology) with a final volume of 100 μL. 25 μL of assay...
Ligand InfoPC cidPC sid
In DepthDetails US Patent
TargetHeat shock protein HSP 90-beta(Homo sapiens (Human))
University Of Kansas
US Patent
LigandPNGBDBM483489(US10927076, Compound Table1A.5)
Affinity DataKd: >1.00E+5nM. Assay description: Assay was performed in 96-well format in black, flat bottom plates (Santa Cruz Biotechnology) with a final volume of 100 μL. 25 μL of assay...
Ligand InfoPC cidPC sid
In DepthDetails US Patent