BDBM483498 US10927076, Compound Table1B.3
SMILES CN(c1ccccc1)c1cc(C(=O)N2Cc3ccccc3C2)c(O)cc1CO
InChI Key InChIKey=IPILPDAVTUKJEL-UHFFFAOYSA-N
Data  2 Kd
  Tab Delimited (TSV)   2D SDfile   Computed 3D by Vconf -m prep SDfile
Find this compound or compounds like it in BindingDB:
Activity Spreadsheet -- Enzyme Inhibition Constant Data from BindingDB
Found 2 hits for monomerid = 483498
TargetHeat shock protein HSP 90-alpha(Homo sapiens (Human))
University Of Kansas
US Patent
LigandPNGBDBM483498(US10927076, Compound Table1B.3)
Affinity DataKd:  5.05E+3nM. Assay description: Assay was performed in 96-well format in black, flat bottom plates (Santa Cruz Biotechnology) with a final volume of 100 μL. 25 μL of assay...
Ligand InfoPC cidPC sid
In DepthDetails US Patent
TargetHeat shock protein HSP 90-beta(Homo sapiens (Human))
University Of Kansas
US Patent
LigandPNGBDBM483498(US10927076, Compound Table1B.3)
Affinity DataKd:  1.50E+3nM. Assay description: Assay was performed in 96-well format in black, flat bottom plates (Santa Cruz Biotechnology) with a final volume of 100 μL. 25 μL of assay...
Ligand InfoPC cidPC sid
In DepthDetails US Patent