BDBM483543 4-(((E)-2-(N-cyano-S- methylsulfonimidoyl)vinyl)amino)-N- ((S)-4-fluorobicyclo[4.2.0]octa-1(6),2,4- trien-7-yl)-N'-hydroxy-1,2,5-oxadiazole- 3-carboximidamide::US10927086, Example 15
SMILES CS(=O)(\C=C\Nc1nonc1\C(N[C@H]1Cc2ccc(F)cc12)=N\O)=NC#N
InChI Key InChIKey=HNZUOQKJZVBCEA-ZDHIRRAPSA-N
Data  1 IC50
  Tab Delimited (TSV)   2D SDfile   Computed 3D by Vconf -m prep SDfile
Find this compound or compounds like it in BindingDB:
Activity Spreadsheet -- Enzyme Inhibition Constant Data from BindingDB
Found 1 hit for monomerid = 483543
TargetIndoleamine 2,3-dioxygenase 1(Homo sapiens (Human))
Merck Sharp & Dohme
US Patent
LigandPNGBDBM483543(4-(((E)-2-(N-cyano-S- methylsulfonimidoyl)vinyl)am...)
Affinity DataIC50:  165nM. Assay description: HIS-tagged IDO1 protein was recombinantly expressed in Escherichia coli using ZYP5052 autoinduction media supplemented with 500 μM delta aminole...
Ligand InfoPC cidPC sid
In DepthDetails US Patent