BDBM483589 N-[(7S)-4-fluorobicyclo[4.2.0]octa-1,3,5- trien-7-yl]-N'-hydroxy-4-({2-[methyl(S- methylsulfonimidoyl)amino]ethyl}amino)- 1,2,5-oxadiazole-3-carboximidamide::US10927086, Example 54
SMILES CN(CCNc1nonc1\C(N[C@H]1Cc2ccc(F)cc12)=N/O)S(C)(=N)=O
InChI Key InChIKey=OQZBLGQDXIFWQC-JHQHAWHRSA-N
Data  1 IC50
  Tab Delimited (TSV)   2D SDfile   Computed 3D by Vconf -m prep SDfile
Find this compound or compounds like it in BindingDB:
Activity Spreadsheet -- Enzyme Inhibition Constant Data from BindingDB
Found 1 hit for monomerid = 483589
TargetIndoleamine 2,3-dioxygenase 1(Homo sapiens (Human))
Merck Sharp & Dohme
US Patent
LigandPNGBDBM483589(N-[(7S)-4-fluorobicyclo[4.2.0]octa-1,3,5- trien-7-...)
Affinity DataIC50:  108nM. Assay description: HIS-tagged IDO1 protein was recombinantly expressed in Escherichia coli using ZYP5052 autoinduction media supplemented with 500 μM delta aminole...
Ligand InfoPC cidPC sid
In DepthDetails US Patent