BDBM483598 US10927079, Compound 35b
SMILES Cc1ncc(cn1)-c1nc(c(NC(=O)N[C@H]2[C@@H](O)CC(C)(C)c3cc(F)ccc23)cc1C)-c1ccccc1
InChI Key InChIKey=FEPIUORLYMEUHQ-LBNVMWSVSA-N
Data  1 IC50
  Tab Delimited (TSV)   2D SDfile   Computed 3D by Vconf -m prep SDfile
Find this compound or compounds like it in BindingDB:
Activity Spreadsheet -- Enzyme Inhibition Constant Data from BindingDB
Found 1 hit for monomerid = 483598
TargetHigh affinity nerve growth factor receptor(Homo sapiens (Human))
Mochida Pharmaceutical
US Patent
LigandPNGBDBM483598(US10927079, Compound 35b)
Affinity DataIC50: <0.100nM. Assay description: Measurement was carried out using TrkA LanthaScreen (registered trademark) Eu Kinase Binding Assay (ThermoFisher SCIENTIFIC). To a 384 well plate (Co...
Ligand InfoPC cidPC sid
In DepthDetails US Patent