BDBM483627 N-[(7S)-4-fluorobicyclo[4.2.0]octa-1,3,5- trien-7-yl]-N''-hydroxy-4-({3-[(S- methylsulfonimidoyl)methyl]bicyclo[1.1.1] pentan-1-yl}amino)-1,2,5-oxadiazole-3- carboximidamide (isomer 1)::US10927086, Example 82::US10927086, Example 83
SMILES CS(=N)(=O)CC12CC(C1)(C2)Nc1nonc1\C(N[C@@H]1Cc2ccc(F)cc12)=N/O
InChI Key InChIKey=FLPQIXDOCPMHGD-BCQSOVGCSA-N
Data  2 IC50
  Tab Delimited (TSV)   2D SDfile   Computed 3D by Vconf -m prep SDfile
Find this compound or compounds like it in BindingDB:
Activity Spreadsheet -- Enzyme Inhibition Constant Data from BindingDB
Found 2 hits for monomerid = 483627
TargetIndoleamine 2,3-dioxygenase 1(Homo sapiens (Human))
Merck Sharp & Dohme
US Patent
LigandPNGBDBM483627(N-[(7S)-4-fluorobicyclo[4.2.0]octa-1,3,5- trien-7-...)
Affinity DataIC50:  81.5nM. Assay description: HIS-tagged IDO1 protein was recombinantly expressed in Escherichia coli using ZYP5052 autoinduction media supplemented with 500 μM delta aminole...
Ligand InfoPC cidPC sid
In DepthDetails US Patent
TargetIndoleamine 2,3-dioxygenase 1(Homo sapiens (Human))
Merck Sharp & Dohme
US Patent
LigandPNGBDBM483627(N-[(7S)-4-fluorobicyclo[4.2.0]octa-1,3,5- trien-7-...)
Affinity DataIC50:  91.7nM. Assay description: HIS-tagged IDO1 protein was recombinantly expressed in Escherichia coli using ZYP5052 autoinduction media supplemented with 500 μM delta aminole...
Ligand InfoPC cidPC sid
In DepthDetails US Patent