BDBM483820 1-(trans-5-((4- chloro-3-(thiazol-2- yl)benzyl)oxy)- octahydrocyclopenta- [c]pyrrole-2- carbonyl)- 1H-pyrazole-3- carboxylic acid::US10927105, Ex 345::US11655217, Example 345
SMILES OC(=O)c1ccn(n1)C(=O)N1C[C@@H]2C[C@H](C[C@@H]2C1)OCc1ccc(Cl)c(c1)-c1nccs1
InChI Key InChIKey=UQXZDOAAAOAECH-ZSHCYNCHSA-N
Data  2 IC50
  Tab Delimited (TSV)   2D SDfile   Computed 3D by Vconf -m prep SDfile
Find this compound or compounds like it in BindingDB:
Activity Spreadsheet -- Enzyme Inhibition Constant Data from BindingDB
Found 2 hits for monomerid = 483820
TargetMonoglyceride lipase(Homo sapiens (Human))
H. Lundbeck
US Patent
LigandPNGBDBM483820(1-(trans-5-((4- chloro-3-(thiazol-2- yl)benzyl)oxy...)
Affinity DataIC50: <100nM. Assay description: Proteomes (mouse brain membrane fraction for mouse assays; human prefrontal cortex membrane fractions for human assays) (50 mL, 1.0 mg/mL total prote...
Ligand InfoPC cidPC sid
In DepthDetails US Patent
TargetMonoglyceride lipase(Homo sapiens (Human))
H. Lundbeck
US Patent
LigandPNGBDBM483820(1-(trans-5-((4- chloro-3-(thiazol-2- yl)benzyl)oxy...)
Affinity DataIC50: <100nM. Assay description: Proteomes (mouse brain membrane fraction for mouse assays; human prefrontal cortex membrane fractions for human assays) (50 mL, 1.0 mg/mL total prote...
Ligand InfoPC cidPC sid
In DepthDetails US Patent