BDBM483935 2-(6-Phenyl-3H-imidazo[4,5-b]pyridin-2-yl)morpholine-4-carbonitrile::US10927110, Example 2
SMILES Brc1cnc2[nH]c(nc2c1)C1CCCN(C1)C#N
InChI Key
Data  1 IC50
  Tab Delimited (TSV)   2D SDfile   Computed 3D by Vconf -m prep SDfile
Find this compound or compounds like it in BindingDB:
Activity Spreadsheet -- Enzyme Inhibition Constant Data from BindingDB
Found 1 hit for monomerid = 483935
TargetUbiquitin carboxyl-terminal hydrolase 30(Homo sapiens (Human))
Mission Therapeutics
US Patent
LigandPNGBDBM483935(2-(6-Phenyl-3H-imidazo[4,5-b]pyridin-2-yl)morpholi...)
Affinity DataIC50: >1.00E+4nM. Assay description: Dilution plates were prepared at 21 times the final concentration (2100 μM for a final concentration of 100 μM) in 50% DMSO in a 96-well po...
Ligand InfoPC cidPC sid
In DepthDetails US Patent